Skip to content

feat: Remote rendering 3.1e - source per-part state from registry on save and restore it on load #139

feat: Remote rendering 3.1e - source per-part state from registry on save and restore it on load

feat: Remote rendering 3.1e - source per-part state from registry on save and restore it on load #139

Triggered via pull request September 3, 2026 14:55
Status Failure
Total duration 6m 9s
Artifacts 4

python-tests.yml

on: pull_request
Matrix: test
Fit to window
Zoom out
Zoom in

Annotations

16 errors and 4 warnings
test (3.11)
Process completed with exit code 1.
test (3.11)
Test FAILURES detected.
test (3.11)
Process completed with exit code 1.
test (3.13)
The strategy configuration was canceled because "test._3_11" failed
test (3.13)
Process completed with exit code 1.
test (3.13)
Test FAILURES detected.
test (3.13)
Process completed with exit code 1.
test (3.14)
The strategy configuration was canceled because "test._3_11" failed
test (3.14)
Process completed with exit code 3.
test (3.14)
Both test FAILURES and ERRORS detected.
test (3.14)
The operation was canceled.
test (3.14)
Process completed with exit code 1.
test (3.12)
The strategy configuration was canceled because "test._3_11" failed
test (3.12)
Process completed with exit code 1.
test (3.12)
Test FAILURES detected.
test (3.12)
Process completed with exit code 1.
test (3.11)
Node.js 20 is deprecated. The following actions target Node.js 20 but are being forced to run on Node.js 24: actions/checkout@v4, actions/setup-python@v5, actions/upload-artifact@v4. For more information see: https://github.blog/changelog/2025-09-19-deprecation-of-node-20-on-github-actions-runners/
test (3.13)
Node.js 20 is deprecated. The following actions target Node.js 20 but are being forced to run on Node.js 24: actions/checkout@v4, actions/setup-python@v5, actions/upload-artifact@v4. For more information see: https://github.blog/changelog/2025-09-19-deprecation-of-node-20-on-github-actions-runners/
test (3.14)
Node.js 20 is deprecated. The following actions target Node.js 20 but are being forced to run on Node.js 24: actions/checkout@v4, actions/setup-python@v5, actions/upload-artifact@v4. For more information see: https://github.blog/changelog/2025-09-19-deprecation-of-node-20-on-github-actions-runners/
test (3.12)
Node.js 20 is deprecated. The following actions target Node.js 20 but are being forced to run on Node.js 24: actions/checkout@v4, actions/setup-python@v5, actions/upload-artifact@v4. For more information see: https://github.blog/changelog/2025-09-19-deprecation-of-node-20-on-github-actions-runners/

Artifacts

Produced during runtime
Name Size Digest
test-logs-test-py3.11
1.06 MB
sha256:9cdd49c9108b2619ba21a915bd6b65b55f2c1b12acd68b5bfe72a1da7924dead
test-logs-test-py3.12
1.04 MB
sha256:41f8bfe3198273dbdff3455868f497fdeab500be5d19db7c61728a033e87974a
test-logs-test-py3.13
1.06 MB
sha256:fdf6f247e41b916965602c71d895ea31dbc7b73b86636dab54ea5c3b92c6cf21
test-logs-test-py3.14
1.06 MB
sha256:ac71e48511e88cb45d69ac725bf9cdd2901256a9721a330389704ce041dafe35