feat: Remote rendering 3.1e - source per-part state from registry on save and restore it on load #84
Annotations
16 errors and 4 warnings
|
test (3.13)
Process completed with exit code 1.
|
|
test (3.13)
Test FAILURES detected.
|
|
test (3.13)
Process completed with exit code 1.
|
|
test (3.11)
The strategy configuration was canceled because "test._3_13" failed
|
|
test (3.11)
Process completed with exit code 1.
|
|
test (3.11)
Test FAILURES detected.
|
|
test (3.11)
Process completed with exit code 1.
|
|
test (3.14)
The strategy configuration was canceled because "test._3_13" failed
|
|
test (3.14)
Process completed with exit code 1.
|
|
test (3.14)
Test FAILURES detected.
|
|
test (3.14)
The operation was canceled.
|
|
test (3.14)
Process completed with exit code 1.
|
|
test (3.12)
The strategy configuration was canceled because "test._3_13" failed
|
|
test (3.12)
Process completed with exit code 3.
|
|
test (3.12)
Both test FAILURES and ERRORS detected.
|
|
test (3.12)
The operation was canceled.
|
|
test (3.13)
Node.js 20 is deprecated. The following actions target Node.js 20 but are being forced to run on Node.js 24: actions/checkout@v4, actions/setup-python@v5, actions/upload-artifact@v4. For more information see: https://github.blog/changelog/2025-09-19-deprecation-of-node-20-on-github-actions-runners/
|
|
test (3.11)
Node.js 20 is deprecated. The following actions target Node.js 20 but are being forced to run on Node.js 24: actions/checkout@v4, actions/setup-python@v5, actions/upload-artifact@v4. For more information see: https://github.blog/changelog/2025-09-19-deprecation-of-node-20-on-github-actions-runners/
|
|
test (3.14)
Node.js 20 is deprecated. The following actions target Node.js 20 but are being forced to run on Node.js 24: actions/checkout@v4, actions/setup-python@v5, actions/upload-artifact@v4. For more information see: https://github.blog/changelog/2025-09-19-deprecation-of-node-20-on-github-actions-runners/
|
|
test (3.12)
Node.js 20 is deprecated. The following actions target Node.js 20 but are being forced to run on Node.js 24: actions/checkout@v4, actions/setup-python@v5, actions/upload-artifact@v4. For more information see: https://github.blog/changelog/2025-09-19-deprecation-of-node-20-on-github-actions-runners/
|
Artifacts
Produced during runtime
| Name | Size | Digest | |
|---|---|---|---|
|
test-logs-test-py3.11
|
1.93 MB |
sha256:61940ae9929992d76079e320e2585cf75d693332636cf998dc0dbe7cf0dd2c37
|
|
|
test-logs-test-py3.12
|
1.94 MB |
sha256:6ca8cdff040cefbab5fad31f336a4f473d9871fcfc88c0baf6f94917a9d7a330
|
|
|
test-logs-test-py3.13
|
1.93 MB |
sha256:207b5dee2b78c948ea95151e3e43f858581b421a540b0bed2487b773dad40098
|
|
|
test-logs-test-py3.14
|
1.92 MB |
sha256:6caa21593a6c4ebf9aeecbb5bfaada775666d210fa56fa3de3e54c61f11fe1ff
|
|